{"text_format":"1","workbook":"xlsx","n_sheets":3,"sheets":["Order Form","Search","PriceLevels"],"not_rendered":{"charts":0,"images":1,"macros":1,"external_links":0,"defined_names":57,"comments":0,"pivot_tables":0},"unopened":[],"bounds":{"document_bytes":16777216,"sheet_cells":100000,"rows_first":2000,"rows_last":500,"rows_between":2000,"halvings":0,"cell_chars":16384,"cell_head_chars":4096},"cells_cut":0,"cells_raw":0,"read":"whole","date_system":"1900"}

{"sheet":"Order Form","index":0,"n_rows":884,"n_cols":125,"rows_kept":884,"cut":false,"hidden":false,"merged":[[6,40,6,41],[8,43,8,46],[1,7,1,9],[2,7,2,9],[3,7,3,9]]}
[null,null,null,null,null,null,null,"Charge To Address",null,null,"Ship To Address","Customer No",null,null,null,null,null,null,null,null,null,null,null,null,null,null,null,null,null,null,null,null,null,null,null,null,"FAX To ","800-624-7110",null,null,null,null,null,null,null,null,null,null,null,null,null,null,null,null,null,null,null,null,null,null,null,null,null,null,null,null,null,null,null,null,null,null,null,null,null,null,null,null,null,null,null,"RecordType",null,"PrimarySeq","Sec Seq","PrimaryDesc","SecondaryDesc",null,null,null,null,null,null,null,null,null,null,null,null,null,null,null,null,null,null,null,null,null,null,"PrimarySeq","PrimaryDesc",null,null,null,null,null,null,null,null,null,null,"Product Number","Description",null,"CriteriaCount"]
[null,null,null,null,null,null,null,null,null,null,null,null,null,null,null,null,null,null,null,null,null,null,null,null,null,null,null,null,null,null,null,null,null,null,null,null,"Phone","866-587-6747",null,null,null,null,null,null,null,null,null,"Price Index",1,null,null,null,null,null,null,null,null,null,null,null,null,null,null,null,null,null,null,null,null,null,null,null,null,null,null,null,null,null,null,null,null,3,null,1,1,"MASTERY SERIES FLY LINES","MASTERY FRESHWATER FLOATING LINES - GPX",null,null,null,null,null,null,null,null,null,null,null,null,null,null,null,null,null,null,null,null,null,null,1,"MASTERY SERIES FLY LINES",null,null,null,null,null,null,null,null,null,null,123,null,null,{"$f":"COUNTA(DS2:DS11)","v":0}]
[null,null,null,null,null,null,null,null,null,null,null,"PO Number",null,null,null,null,null,null,null,null,null,null,null,null,null,null,null,null,null,null,null,null,null,null,null,null,"Email To ","dealersupport@scientificanglers.com",null,null,null,null,null,null,null,null,null,"Real Price Col",{"$f":"INDEX(RealPriceCol,AW2)","v":1},null,null,null,null,null,null,null,null,null,null,null,null,null,null,null,null,null,null,null,null,null,null,null,null,null,null,null,null,null,null,null,null,null,null,1,2,"MASTERY SERIES FLY LINES","MASTERY FRESHWATER FLOATING LINES - XPS",null,null,null,null,null,null,null,null,null,null,null,null,null,null,null,null,null,null,null,null,null,null,2,"PROFESSIONAL SERIES FLY LINES"]
[null,null,null,null,null,null,null,null,null,null,null,null,null,null,null,null,null,null,null,null,null,null,null,null,null,null,null,null,null,null,null,null,null,null,null,null,"Mail to ","Scientific Anglers",null,null,null,null,null,null,null,null,null,null,null,null,null,null,null,null,null,null,null,null,null,null,null,null,null,null,null,null,null,null,null,null,null,null,null,null,null,null,null,null,null,null,null,null,null,1,3,"MASTERY SERIES FLY LINES","MASTERY FRESHWATER FLOATING LINES - DISTANCE",null,null,null,null,null,null,null,null,null,null,null,null,null,null,null,null,null,null,null,null,null,null,3,"LEADERS, TIPPETS AND BACKING"]
[null,null,null,null,null,null,null,"Special Instructions",null,null,null,"Order Date",null,null,null,null,null,null,null,null,null,null,null,null,null,null,null,null,null,null,null,null,null,null,null,null,null,"4100 James Savage Rd.",null,null,null,null,null,null,null,null,null,null,null,null,null,null,null,null,null,null,null,null,null,null,null,null,null,null,null,null,null,null,null,null,null,null,null,null,null,null,null,null,null,null,null,null,null,1,4,"MASTERY SERIES FLY LINES","MASTERY FRESHWATER FLOATING LINES - HEADSTART™",null,null,null,null,null,null,null,null,null,null,null,null,null,null,null,null,null,null,null,null,null,null,4,"FLY REELS, SPOOLS AND OUTFITS"]
[null,null,null,null,null,null,null,"Contact",null,null,null,null,null,null,null,null,null,null,null,null,null,null,null,null,null,null,null,null,null,null,null,null,null,null,null,null,null,"Midland, MI   48642",null,null,null,null,null,null,null,null,null,null,null,null,null,null,null,null,null,null,null,null,null,null,null,null,null,null,null,null,null,null,null,null,null,null,null,null,null,null,null,null,null,null,null,null,null,1,5,"MASTERY SERIES FLY LINES","MASTERY FRESHWATER FLOATING LINES - NYMPH TAPER",null,null,null,null,null,null,null,null,null,null,null,null,null,null,null,null,null,null,null,null,null,null,5,"FLY BOXES AND FLY FISHING ACCESSORIES"]
[null,null,null,null,null,null,null,"Phone number",null,null,null,null,null,null,null,null,null,null,null,null,null,null,null,null,null,null,null,null,null,null,null,null,null,null,null,"Ship Date",null,null,null,null,"Total",null,null,null,null,null,null,null,null,null,null,null,null,null,null,null,null,null,null,null,null,null,null,null,null,null,null,null,null,null,null,null,null,null,null,null,null,null,null,null,null,null,null,1,6,"MASTERY SERIES FLY LINES","MASTERY FRESHWATER FLOATING LINES - BASS BUG TAPER",null,null,null,null,null,null,null,null,null,null,null,null,null,null,null,null,null,null,null,null,null,null,6,"CASES, PACKS, GEAR BAGS AND BOATS"]
[null,null,null,null,null,null,null,null,null,null,null,null,null,null,null,null,null,null,null,null,null,null,null,null,null,null,null,null,null,null,null,null,null,null,null,"PO Number",null,null,null,null,"Units","Purchase",null,null,null,null,null,null,null,null,null,null,null,null,null,null,null,null,null,null,null,null,null,null,null,null,null,null,null,null,null,null,null,null,null,null,null,null,null,null,null,null,null,1,7,"MASTERY SERIES FLY LINES","MASTERY FRESHWATER FLOATING LINES - PIKE TAPER",null,null,null,null,null,null,null,null,null,null,null,null,null,null,null,null,null,null,null,null,null,null,8,"FLY TYING TOOLS AND MATERIALS"]
[null,null,null,null,null,null,null,null,null,null,null,null,null,null,null,null,null,null,null,null,null,null,null,null,null,null,null,null,null,null,null,null,null,null,null,null,{"$f":"SUM(AR12:AR884)","v":0},{"$f":"SUM(AS12:AS884)","v":0},0,0,{"$f":"SUM(AO11:AO2101)","v":0},{"$f":"SUM(AP11:AP2101)","v":0},null,"Ship Date Dollars",null,null,null,null,null,null,"Calculation prototype for detail lines",null,null,null,null,null,null,null,null,null,null,null,null,null,null,null,null,null,null,null,null,null,null,null,null,null,null,null,null,null,null,null,null,1,8,"MASTERY SERIES FLY LINES","MASTERY FRESHWATER FLOATING LINES - STEELHEAD TAPER",null,null,null,null,null,null,null,null,null,null,null,null,null,null,null,null,null,null,null,null,null,null,9,"BOOKS AND VIDEOS"]
[null,null,null,null,null,null,null,null,null,null,null,null,null,null,null,null,null,null,null,null,null,null,null,null,null,null,null,null,null,null,null,null,null,null,null,null,null,null,null,null,null,null,null,null,null,null,null,null,null,null,null,null,null,null,null,null,null,null,null,null,null,null,null,null,null,null,null,null,null,null,null,null,null,null,null,null,null,null,null,null,null,null,null,1,9,"MASTERY SERIES FLY LINES","MASTERY FRESHWATER FLOATING LINES - WINDMASTER"]
["PrimarySeq","Sec Seq","SortSeqn","RecordType","SortKey","PrimaryDesc","SecondaryDesc","Order Number","Flag","Description","Product Number","UPC Number","Pkg Qty","Price Unit","Sugg Retail","Level 1","Level 2","Level 3","Tier 4","Tier 5","Tier 6","Tier 7","Tier 8","Tier 9","Tier 10","Tier 11","Tier 12","Tier 13","Tier 14","Tier 15","Tier 16","Tier 17","Tier 18","Tier 19","Tier 20",{"$f":"INDEX(PriceLevel,'Order Form'!AW2)","v":"Level 1"},"Shipment 1","Shipment 2","Shipment 3","Shipment 4","Qty","Total Purch","Dummy","Ship Date 1","Ship Date 2","Ship Date 3","Ship Date 4","Periods with data",null,null,{"$f":"IF(OR(ISBLANK($L11),$AW$3=0),\" - \",OFFSET(AD11,0,$AW$3,1,1))","v":"Tier 16"},null,null,null,null,{"$f":"IF($AV11=0,\"\",SUM(AZ11:BC11))","v":0},{"$f":"IF($AV11>0,SUM(BG11:BJ11),\"\")","v":{"$error":"#VALUE!"}},null,{"$f":"IF(LEN($AJ11)>0,$AJ11*AZ11,\"\")","v":{"$error":"#VALUE!"}},{"$f":"IF(LEN($AJ11)>0,$AJ11*BA11,\"\")","v":{"$error":"#VALUE!"}},{"$f":"IF(LEN($AJ11)>0,$AJ11*BB11,\"\")","v":{"$error":"#VALUE!"}},{"$f":"IF(LEN($AJ11)>0,$AJ11*BC11,\"\")","v":{"$error":"#VALUE!"}},{"$f":"COUNT(AZ11:BC11)","v":0},{"$f":"IF($AV11<>0,ROW($AV$11),\"\")","v":11},null,null,null,null,null,null,null,null,null,null,null,null,null,null,null,null,null,null,null,1,10,"MASTERY SERIES FLY LINES","MASTERY FRESHWATER FLOATING LINES - SPEY/SALMON TAPER"]
[1,0,null,1,"\u0001","MASTERY SERIES FLY LINES",null,"SHARKWAVE SERIES FLY LINES - Workbook pages 6-13"]
[1,1,null,2,"\u0001","MASTERY SERIES FLY LINES","SHARKWAVE ULTIMATE TROUT TAPER - MIST GREEN/WILLOW/DK WILLOW","SHARKWAVE ULTIMATE TROUT TAPER - MIST GREEN/WILLOW/DK WILLOW"]
[1,1,1,3,"Blue Heron WF- 3-F","MASTERY SERIES FLY LINES","SHARKWAVE ULTIMATE TROUT TAPER - MIST GREEN/WILLOW/DK WILLOW",102087,"*","WF- 3-F      ",null,"840309102087","1","EACH",99.95,49.98,44.98,39.979999999999997,null,null,null,null,null,null,null,null,null,null,null,null,null,null,null,null,null,{"$f":"IF(OR(ISBLANK($L14),$AW$3=0),\" - \",OFFSET(O14,0,$AW$3,1,1))","v":49.98},null,null,null,null,{"$f":"IF($AV14=0,\"\",SUM(AK14:AN14))","v":""},{"$f":"IF($AV14>0,SUM(AR14:AU14),\"\")","v":""},null,{"$f":"IF(LEN($AJ14)>0,$AJ14*AK14,\"\")","v":0},0,0,0,{"$f":"COUNT(AK14:AN14)","v":0},{"$f":"IF($AV14<>0,ROW($AV$11),\"\")","v":""}]
[1,1,1,3,"Blue Heron WF- 4-F","MASTERY SERIES FLY LINES","SHARKWAVE ULTIMATE TROUT TAPER - MIST GREEN/WILLOW/DK WILLOW",102094,"*","WF- 4-F      ",null,"840309102094","1","EACH",99.95,49.98,44.98,39.979999999999997,null,null,null,null,null,null,null,null,null,null,null,null,null,null,null,null,null,49.98,null,null,null,null,"","",null,0,0,0,0,0,""]
[1,1,1,3,"Blue Heron WF- 5-F","MASTERY SERIES FLY LINES","SHARKWAVE ULTIMATE TROUT TAPER - MIST GREEN/WILLOW/DK WILLOW",102100,"*","WF- 5-F      ",null,"840309102100","1","EACH",99.95,49.98,44.98,39.979999999999997,null,null,null,null,null,null,null,null,null,null,null,null,null,null,null,null,null,49.98,null,null,null,null,"","",null,0,0,0,0,0,""]
[1,1,1,3,"Blue Heron WF- 6-F","MASTERY SERIES FLY LINES","SHARKWAVE ULTIMATE TROUT TAPER - MIST GREEN/WILLOW/DK WILLOW",102117,"*","WF -6-F      ",null,"840309102117","1","EACH",99.95,49.98,44.98,39.979999999999997,null,null,null,null,null,null,null,null,null,null,null,null,null,null,null,null,null,49.98,null,null,null,null,"","",null,0,0,0,0,0,""]
[1,1,1,3,"Blue Heron WF- 7-F","MASTERY SERIES FLY LINES","SHARKWAVE ULTIMATE TROUT TAPER - MIST GREEN/WILLOW/DK WILLOW",102124,"*","WF- 7-F      ",null,"840309102124","1","EACH",99.95,49.98,44.98,39.979999999999997,null,null,null,null,null,null,null,null,null,null,null,null,null,null,null,null,null,49.98,null,null,null,null,"","",null,0,0,0,0,0,""]
[1,1,1,3,"Blue Heron WF- 8-F","MASTERY SERIES FLY LINES","SHARKWAVE ULTIMATE TROUT TAPER - MIST GREEN/WILLOW/DK WILLOW",119368,"*","WF- 8-F      ",null,"840309119368","1","EACH",99.95,49.98,44.98,39.979999999999997,null,null,null,null,null,null,null,null,null,null,null,null,null,null,null,null,null,49.98,null,null,null,null,"","",null,0,0,0,0,0,""]
[1,2,null,2,"\u0001","MASTERY SERIES FLY LINES","SHARKWAVE ULTIMATE TROUT TAPER - IVORY/OPTIC GREEN/WILLOW","SHARKWAVE ULTIMATE TROUT TAPER - IVORY/OPTIC GREEN/WILLOW"]
[1,2,1,3,"Chartruese WF- 3-F","MASTERY SERIES FLY LINES","SHARKWAVE ULTIMATE TROUT TAPER - IVORY/OPTIC GREEN/WILLOW",102032,"*","WF- 3-F      ",null,"840309102032","1","EACH",99.95,49.98,44.98,39.979999999999997,null,null,null,null,null,null,null,null,null,null,null,null,null,null,null,null,null,{"$f":"IF(OR(ISBLANK($L21),$AW$3=0),\" - \",OFFSET(O21,0,$AW$3,1,1))","v":49.98},null,null,null,null,{"$f":"IF($AV21=0,\"\",SUM(AK21:AN21))","v":""},{"$f":"IF($AV21>0,SUM(AR21:AU21),\"\")","v":""},null,{"$f":"IF(LEN($AJ21)>0,$AJ21*AK21,\"\")","v":0},0,0,0,{"$f":"COUNT(AK21:AN21)","v":0},{"$f":"IF($AV21<>0,ROW($AV$11),\"\")","v":""}]
[1,2,1,3,"Chartruese WF- 4-F","MASTERY SERIES FLY LINES","SHARKWAVE ULTIMATE TROUT TAPER - IVORY/OPTIC GREEN/WILLOW",102049,"*","WF- 4-F      ",null,"840309102049","1","EACH",99.95,49.98,44.98,39.979999999999997,null,null,null,null,null,null,null,null,null,null,null,null,null,null,null,null,null,49.98,null,null,null,null,"","",null,0,0,0,0,0,""]
[1,2,1,3,"Chartruese WF- 5-F","MASTERY SERIES FLY LINES","SHARKWAVE ULTIMATE TROUT TAPER - IVORY/OPTIC GREEN/WILLOW",102056,"*","WF- 5-F      ",null,"840309102056","1","EACH",99.95,49.98,44.98,39.979999999999997,null,null,null,null,null,null,null,null,null,null,null,null,null,null,null,null,null,49.98,null,null,null,null,"","",null,0,0,0,0,0,""]
[1,2,1,3,"Chartruese WF- 6-F","MASTERY SERIES FLY LINES","SHARKWAVE ULTIMATE TROUT TAPER - IVORY/OPTIC GREEN/WILLOW",102063,"*","WF- 6-F      ",null,"840309102063","1","EACH",99.95,49.98,44.98,39.979999999999997,null,null,null,null,null,null,null,null,null,null,null,null,null,null,null,null,null,49.98,null,null,null,null,"","",null,0,0,0,0,0,""]
[1,2,1,3,"Chartruese WF- 7-F","MASTERY SERIES FLY LINES","SHARKWAVE ULTIMATE TROUT TAPER - IVORY/OPTIC GREEN/WILLOW",102070,"*","WF- 7-F      ",null,"840309102070","1","EACH",99.95,49.98,44.98,39.979999999999997,null,null,null,null,null,null,null,null,null,null,null,null,null,null,null,null,null,49.98,null,null,null,null,{"$f":"IF($AV25=0,\"\",SUM(AK25:AN25))","v":""},{"$f":"IF($AV25>0,SUM(AR25:AU25),\"\")","v":""},null,0,0,0,0,0,""]
[1,2,1,3,"Chartruese WF- 8-F","MASTERY SERIES FLY LINES","SHARKWAVE ULTIMATE TROUT TAPER - IVORY/OPTIC GREEN/WILLOW",119375,"*","WF- 8-F      ",null,"840309119375","1","EACH",99.95,49.98,44.98,39.979999999999997,null,null,null,null,null,null,null,null,null,null,null,null,null,null,null,null,null,49.98,null,null,null,null,"","",null,0,0,0,0,0,""]
[1,4,null,2,"\u0001","MASTERY SERIES FLY LINES","SHARKWAVE GPX TAPER - BUCKSKIN/BLUE/OPTIC GREEN","SHARKWAVE GPX TAPER - BUCKSKIN/BLUE/OPTIC GREEN"]
[1,4,1,3,"Optic Green WF- 3-F","MASTERY SERIES FLY LINES","SHARKWAVE GPX TAPER - BUCKSKIN/BLUE/OPTIC GREEN",100526,"*","WF- 3-F      ",null,"840309100526","1","EACH",99.95,49.98,44.98,39.979999999999997,null,null,null,null,null,null,null,null,null,null,null,null,null,null,null,null,null,{"$f":"IF(OR(ISBLANK($L28),$AW$3=0),\" - \",OFFSET(O28,0,$AW$3,1,1))","v":49.98},null,null,null,null,{"$f":"IF($AV28=0,\"\",SUM(AK28:AN28))","v":""},{"$f":"IF($AV28>0,SUM(AR28:AU28),\"\")","v":""},null,{"$f":"IF(LEN($AJ28)>0,$AJ28*AK28,\"\")","v":0},0,0,0,{"$f":"COUNT(AK28:AN28)","v":0},{"$f":"IF($AV28<>0,ROW($AV$11),\"\")","v":""}]
[1,4,2,3,"Optic Green WF- 4-F","MASTERY SERIES FLY LINES","SHARKWAVE GPX TAPER - BUCKSKIN/BLUE/OPTIC GREEN",100533,"*","WF- 4-F      ",null,"840309100533","1","EACH",99.95,49.98,44.98,39.979999999999997,null,null,null,null,null,null,null,null,null,null,null,null,null,null,null,null,null,49.98,null,null,null,null,"","",null,0,0,0,0,0,""]
[1,4,3,3,"Optic Green WF- 5-F","MASTERY SERIES FLY LINES","SHARKWAVE GPX TAPER - BUCKSKIN/BLUE/OPTIC GREEN",100540,"*","WF- 5-F      ",null,"840309100540","1","EACH",99.95,49.98,44.98,39.979999999999997,null,null,null,null,null,null,null,null,null,null,null,null,null,null,null,null,null,49.98,null,null,null,null,"","",null,0,0,0,0,0,""]
[1,4,4,3,"Optic Green WF- 6-F","MASTERY SERIES FLY LINES","SHARKWAVE GPX TAPER - BUCKSKIN/BLUE/OPTIC GREEN",100557,"*","WF- 6-F      ",null,"840309100557","1","EACH",99.95,49.98,44.98,39.979999999999997,null,null,null,null,null,null,null,null,null,null,null,null,null,null,null,null,null,49.98,null,null,null,null,"","",null,0,0,0,0,0,""]
[1,4,5,3,"Optic Green WF- 7-F","MASTERY SERIES FLY LINES","SHARKWAVE GPX TAPER - BUCKSKIN/BLUE/OPTIC GREEN",100564,"*","WF- 7-F      ",null,"840309100564","1","EACH",99.95,49.98,44.98,39.979999999999997,null,null,null,null,null,null,null,null,null,null,null,null,null,null,null,null,null,49.98,null,null,null,null,"","",null,0,0,0,0,0,""]
[1,4,6,3,"Optic Green WF- 8-F","MASTERY SERIES FLY LINES","SHARKWAVE GPX TAPER - BUCKSKIN/BLUE/OPTIC GREEN",100571,"*","WF- 8-F      ",null,"840309100571","1","EACH",99.95,49.98,44.98,39.979999999999997,null,null,null,null,null,null,null,null,null,null,null,null,null,null,null,null,null,49.98,null,null,null,null,"","",null,0,0,0,0,0,""]
[1,4,7,3,"Optic Green WF- 9-F","MASTERY SERIES FLY LINES","SHARKWAVE GPX TAPER - BUCKSKIN/BLUE/OPTIC GREEN",100588,"*","WF- 9-F      ",null,"840309100588","1","EACH",99.95,49.98,44.98,39.979999999999997,null,null,null,null,null,null,null,null,null,null,null,null,null,null,null,null,null,49.98,null,null,null,null,"","",null,0,0,0,0,0,""]
[1,5,null,2,"\u0001","MASTERY SERIES FLY LINES","SHARKWAVE GPX TAPER - CHARTRUESE/DK WILLOW/WILLOW","SHARKWAVE GPX TAPER - CHARTRUESE/DK WILLOW/WILLOW"]
[1,5,1,3,"Willow WF- 3-F","MASTERY SERIES FLY LINES","SHARKWAVE GPX TAPER - CHARTRUESE/DK WILLOW/WILLOW",100595,"*","WF- 3-F      ",null,"840309100595","1","EACH",99.95,49.98,44.98,39.979999999999997,null,null,null,null,null,null,null,null,null,null,null,null,null,null,null,null,null,{"$f":"IF(OR(ISBLANK($L36),$AW$3=0),\" - \",OFFSET(O36,0,$AW$3,1,1))","v":49.98},null,null,null,null,{"$f":"IF($AV36=0,\"\",SUM(AK36:AN36))","v":""},{"$f":"IF($AV36>0,SUM(AR36:AU36),\"\")","v":""},null,{"$f":"IF(LEN($AJ36)>0,$AJ36*AK36,\"\")","v":0},0,0,0,{"$f":"COUNT(AK36:AN36)","v":0},{"$f":"IF($AV36<>0,ROW($AV$11),\"\")","v":""}]
[1,5,2,3,"Willow WF- 4-F","MASTERY SERIES FLY LINES","SHARKWAVE GPX TAPER - CHARTRUESE/DK WILLOW/WILLOW",100601,"*","WF- 4-F      ",null,"840309100601","1","EACH",99.95,49.98,44.98,39.979999999999997,null,null,null,null,null,null,null,null,null,null,null,null,null,null,null,null,null,49.98,null,null,null,null,"","",null,0,0,0,0,0,""]
[1,5,3,3,"Willow WF- 5-F","MASTERY SERIES FLY LINES","SHARKWAVE GPX TAPER - CHARTRUESE/DK WILLOW/WILLOW",100618,"*","WF- 5-F      ",null,"840309100618","1","EACH",99.95,49.98,44.98,39.979999999999997,null,null,null,null,null,null,null,null,null,null,null,null,null,null,null,null,null,49.98,null,null,null,null,"","",null,0,0,0,0,0,""]
[1,5,4,3,"Willow WF- 6-F","MASTERY SERIES FLY LINES","SHARKWAVE GPX TAPER - CHARTRUESE/DK WILLOW/WILLOW",100625,"*","WF- 6-F      ",null,"840309100625","1","EACH",99.95,49.98,44.98,39.979999999999997,null,null,null,null,null,null,null,null,null,null,null,null,null,null,null,null,null,49.98,null,null,null,null,"","",null,0,0,0,0,0,""]
[1,5,5,3,"Willow WF- 7-F","MASTERY SERIES FLY LINES","SHARKWAVE GPX TAPER - CHARTRUESE/DK WILLOW/WILLOW",100632,"*","WF- 7-F      ",null,"840309100632","1","EACH",99.95,49.98,44.98,39.979999999999997,null,null,null,null,null,null,null,null,null,null,null,null,null,null,null,null,null,49.98,null,null,null,null,"","",null,0,0,0,0,0,""]
{"$rows_left_out":845}
{"sheet":"Search","index":1,"n_rows":7,"n_cols":3,"rows_kept":7,"cut":false,"hidden":false,"merged":[]}
[]
[]
[]
[null,"Product Number",123]
[null,null,{"$f":"\"- OR -\"","v":"- OR -"}]
[null,"Description Keywords"]
[null,null,"Separate multiple keywords with a space between each word."]

{"sheet":"PriceLevels","index":2,"n_rows":4,"n_cols":3,"rows_kept":4,"cut":false,"hidden":true,"merged":[]}
["PriceCol","PriceLevel","RealPriceCol"]
[1,"Level 1",1]
[2,"Level 2",2]
[3,"Level 3",3]