{"text_format":"1","workbook":"xlsx","n_sheets":3,"sheets":["Order Form","Search","PriceLevels"],"not_rendered":{"charts":0,"images":1,"macros":1,"external_links":0,"defined_names":57,"comments":0,"pivot_tables":0},"unopened":[],"bounds":{"document_bytes":16777216,"sheet_cells":100000,"rows_first":2000,"rows_last":500,"rows_between":2000,"halvings":0,"cell_chars":16384,"cell_head_chars":4096},"cells_cut":0,"cells_raw":0,"read":"whole","date_system":"1900"}

{"sheet":"Order Form","index":0,"n_rows":411,"n_cols":125,"rows_kept":411,"cut":false,"hidden":false,"merged":[[6,40,6,41],[8,43,8,46],[1,7,1,9],[2,7,2,9],[3,7,3,9]]}
[null,null,null,null,null,null,null,"Charge To Address",null,null,"Ship To Address","Customer No",null,null,null,null,null,null,null,null,null,null,null,null,null,null,null,null,null,null,null,null,null,null,null,null,"FAX To ","800-624-7110",null,null,null,null,null,null,null,null,null,null,null,null,null,null,null,null,null,null,null,null,null,null,null,null,null,null,null,null,null,null,null,null,null,null,null,null,null,null,null,null,null,null,null,"RecordType",null,"PrimarySeq","Sec Seq","PrimaryDesc","SecondaryDesc",null,null,null,null,null,null,null,null,null,null,null,null,null,null,null,null,null,null,null,null,null,null,"PrimarySeq","PrimaryDesc",null,null,null,null,null,null,null,null,null,null,"Product Number","Description",null,"CriteriaCount"]
[null,null,null,null,null,null,null,null,null,null,null,null,null,null,null,null,null,null,null,null,null,null,null,null,null,null,null,null,null,null,null,null,null,null,null,null,"Phone","866-587-6747",null,null,null,null,null,null,null,null,null,"Price Index",1,null,null,null,null,null,null,null,null,null,null,null,null,null,null,null,null,null,null,null,null,null,null,null,null,null,null,null,null,null,null,null,null,3,null,1,1,"MASTERY SERIES FLY LINES","MASTERY FRESHWATER FLOATING LINES - GPX",null,null,null,null,null,null,null,null,null,null,null,null,null,null,null,null,null,null,null,null,null,null,1,"MASTERY SERIES FLY LINES",null,null,null,null,null,null,null,null,null,null,123,null,null,{"$f":"COUNTA(DS2:DS11)","v":0}]
[null,null,null,null,null,null,null,null,null,null,null,"PO Number",null,null,null,null,null,null,null,null,null,null,null,null,null,null,null,null,null,null,null,null,null,null,null,null,"Email To ","dealersupport@scientificanglers.com",null,null,null,null,null,null,null,null,null,"Real Price Col",{"$f":"INDEX(RealPriceCol,AW2)","v":1},null,null,null,null,null,null,null,null,null,null,null,null,null,null,null,null,null,null,null,null,null,null,null,null,null,null,null,null,null,null,null,null,null,null,1,2,"MASTERY SERIES FLY LINES","MASTERY FRESHWATER FLOATING LINES - XPS",null,null,null,null,null,null,null,null,null,null,null,null,null,null,null,null,null,null,null,null,null,null,2,"PROFESSIONAL SERIES FLY LINES"]
[null,null,null,null,null,null,null,null,null,null,null,null,null,null,null,null,null,null,null,null,null,null,null,null,null,null,null,null,null,null,null,null,null,null,null,null,"Mail to ","Scientific Anglers",null,null,null,null,null,null,null,null,null,null,null,null,null,null,null,null,null,null,null,null,null,null,null,null,null,null,null,null,null,null,null,null,null,null,null,null,null,null,null,null,null,null,null,null,null,1,3,"MASTERY SERIES FLY LINES","MASTERY FRESHWATER FLOATING LINES - DISTANCE",null,null,null,null,null,null,null,null,null,null,null,null,null,null,null,null,null,null,null,null,null,null,3,"LEADERS, TIPPETS AND BACKING"]
[null,null,null,null,null,null,null,"Special Instructions",null,null,null,"Order Date",null,null,null,null,null,null,null,null,null,null,null,null,null,null,null,null,null,null,null,null,null,null,null,null,null,"4100 James Savage Rd.",null,null,null,null,null,null,null,null,null,null,null,null,null,null,null,null,null,null,null,null,null,null,null,null,null,null,null,null,null,null,null,null,null,null,null,null,null,null,null,null,null,null,null,null,null,1,4,"MASTERY SERIES FLY LINES","MASTERY FRESHWATER FLOATING LINES - HEADSTART™",null,null,null,null,null,null,null,null,null,null,null,null,null,null,null,null,null,null,null,null,null,null,4,"FLY REELS, SPOOLS AND OUTFITS"]
[null,null,null,null,null,null,null,"Contact",null,null,null,null,null,null,null,null,null,null,null,null,null,null,null,null,null,null,null,null,null,null,null,null,null,null,null,null,null,"Midland, MI   48642",null,null,null,null,null,null,null,null,null,null,null,null,null,null,null,null,null,null,null,null,null,null,null,null,null,null,null,null,null,null,null,null,null,null,null,null,null,null,null,null,null,null,null,null,null,1,5,"MASTERY SERIES FLY LINES","MASTERY FRESHWATER FLOATING LINES - NYMPH TAPER",null,null,null,null,null,null,null,null,null,null,null,null,null,null,null,null,null,null,null,null,null,null,5,"FLY BOXES AND FLY FISHING ACCESSORIES"]
[null,null,null,null,null,null,null,"Phone number",null,null,null,null,null,null,null,null,null,null,null,null,null,null,null,null,null,null,null,null,null,null,null,null,null,null,null,"Ship Date",null,null,null,null,"Total",null,null,null,null,null,null,null,null,null,null,null,null,null,null,null,null,null,null,null,null,null,null,null,null,null,null,null,null,null,null,null,null,null,null,null,null,null,null,null,null,null,null,1,6,"MASTERY SERIES FLY LINES","MASTERY FRESHWATER FLOATING LINES - BASS BUG TAPER",null,null,null,null,null,null,null,null,null,null,null,null,null,null,null,null,null,null,null,null,null,null,6,"CASES, PACKS, GEAR BAGS AND BOATS"]
[null,null,null,null,null,null,null,null,null,null,null,null,null,null,null,null,null,null,null,null,null,null,null,null,null,null,null,null,null,null,null,null,null,null,null,"PO Number",null,null,null,null,"Units","Purchase",null,null,null,null,null,null,null,null,null,null,null,null,null,null,null,null,null,null,null,null,null,null,null,null,null,null,null,null,null,null,null,null,null,null,null,null,null,null,null,null,null,1,7,"MASTERY SERIES FLY LINES","MASTERY FRESHWATER FLOATING LINES - PIKE TAPER",null,null,null,null,null,null,null,null,null,null,null,null,null,null,null,null,null,null,null,null,null,null,8,"FLY TYING TOOLS AND MATERIALS"]
[null,null,null,null,null,null,null,null,null,null,null,null,null,null,null,null,null,null,null,null,null,null,null,null,null,null,null,null,null,null,null,null,null,null,null,null,{"$f":"SUM(AR12:AR411)","v":0},{"$f":"SUM(AS12:AS411)","v":0},{"$f":"SUM(AT12:AT411)","v":0},{"$f":"SUM(AU12:AU411)","v":0},{"$f":"SUM(AO11:AO1628)","v":0},{"$f":"SUM(AP11:AP1628)","v":0},null,"Ship Date Dollars",null,null,null,null,null,null,"Calculation prototype for detail lines",null,null,null,null,null,null,null,null,null,null,null,null,null,null,null,null,null,null,null,null,null,null,null,null,null,null,null,null,null,null,null,null,1,8,"MASTERY SERIES FLY LINES","MASTERY FRESHWATER FLOATING LINES - STEELHEAD TAPER",null,null,null,null,null,null,null,null,null,null,null,null,null,null,null,null,null,null,null,null,null,null,9,"BOOKS AND VIDEOS"]
[null,null,null,null,null,null,null,null,null,null,null,null,null,null,null,null,null,null,null,null,null,null,null,null,null,null,null,null,null,null,null,null,null,null,null,null,null,null,null,null,null,null,null,null,null,null,null,null,null,null,null,null,null,null,null,null,null,null,null,null,null,null,null,null,null,null,null,null,null,null,null,null,null,null,null,null,null,null,null,null,null,null,null,1,9,"MASTERY SERIES FLY LINES","MASTERY FRESHWATER FLOATING LINES - WINDMASTER"]
["PrimarySeq","Sec Seq","SortSeqn","RecordType","SortKey","PrimaryDesc","SecondaryDesc","Order Number","Flag","Description","Product Number","UPC Number","Pkg Qty","Price Unit","Sugg Retail","Level 1","Level 2","Level 3","Tier 4","Tier 5","Tier 6","Tier 7","Tier 8","Tier 9","Tier 10","Tier 11","Tier 12","Tier 13","Tier 14","Tier 15","Tier 16","Tier 17","Tier 18","Tier 19","Tier 20",{"$f":"INDEX(PriceLevel,'Order Form'!AW2)","v":"Level 1"},"Shipment 1","Shipment 2","Shipment 3","Shipment 4","Qty","Total Purch","Dummy","Ship Date 1","Ship Date 2","Ship Date 3","Ship Date 4","Periods with data",null,null,{"$f":"IF(OR(ISBLANK($L11),$AW$3=0),\" - \",OFFSET(AD11,0,$AW$3,1,1))","v":"Tier 16"},null,null,null,null,{"$f":"IF($AV11=0,\"\",SUM(AZ11:BC11))","v":0},{"$f":"IF($AV11>0,SUM(BG11:BJ11),\"\")","v":{"$error":"#VALUE!"}},null,{"$f":"IF(LEN($AJ11)>0,$AJ11*AZ11,\"\")","v":{"$error":"#VALUE!"}},{"$f":"IF(LEN($AJ11)>0,$AJ11*BA11,\"\")","v":{"$error":"#VALUE!"}},{"$f":"IF(LEN($AJ11)>0,$AJ11*BB11,\"\")","v":{"$error":"#VALUE!"}},{"$f":"IF(LEN($AJ11)>0,$AJ11*BC11,\"\")","v":{"$error":"#VALUE!"}},{"$f":"COUNT(AZ11:BC11)","v":0},{"$f":"IF($AV11<>0,ROW($AV$11),\"\")","v":11},null,null,null,null,null,null,null,null,null,null,null,null,null,null,null,null,null,null,null,1,10,"MASTERY SERIES FLY LINES","MASTERY FRESHWATER FLOATING LINES - SPEY/SALMON TAPER"]
[2,0,null,1,null,"SCIENTIFIC ANGLERS FLY LINES",null,"FREQUENCY SERIES FLY LINES - Workbook pages 16-20",null,null,null,null,null,null,null,null,null,null,null,null,null,null,null,null,null,null,null,null,null,null,null,null,null,null,null,null,null,null,null,null,{"$f":"IF($AV12=0,\"\",SUM(AK12:AN12))","v":""},{"$f":"IF($AV12>0,SUM(AR12:AU12),\"\")","v":""},null,{"$f":"IF(LEN($AJ12)>0,$AJ12*AK12,\"\")","v":""},"","","",{"$f":"COUNT(AK12:AN12)","v":0},{"$f":"IF($AV12<>0,ROW($AV$11),\"\")","v":""}]
[2,62,null,2,"\u0001","SCIENTIFIC ANGLERS FLY LINES","  FREQUENCY - TROUT WITH LOOP - BUCKSKIN  ","FREQUENCY - TROUT WITH LOOP - BUCKSKIN",null,null,null,null,null,null,null,null,null,null,null,null,null,null,null,null,null,null,null,null,null,null,null,null,null,null,null,null,null,null,null,null,"",""]
[2,62,1,3,"Wlw/Org/Willow WF- 2-F","SCIENTIFIC ANGLERS FLY LINES","  FREQUENCY - TROUT WITH LOOP - BUCKSKIN  ",117166,"*","WF- 3-F      ",null,"840309117166","1","EACH",49.95,27.48,24.98,22.48,null,null,null,null,null,null,null,null,null,null,null,null,null,null,null,null,null,{"$f":"IF(OR(ISBLANK($L14),$AW$3=0),\" - \",OFFSET(O14,0,$AW$3,1,1))","v":27.48},null,null,null,null,"","",null,{"$f":"IF(LEN($AJ14)>0,$AJ14*AK14,\"\")","v":0},0,0,0,{"$f":"COUNT(AK14:AN14)","v":0},{"$f":"IF($AV14<>0,ROW($AV$11),\"\")","v":""}]
[2,62,2,3,"Wlw/Org/Willow WF- 3-F","SCIENTIFIC ANGLERS FLY LINES","  FREQUENCY - TROUT WITH LOOP - BUCKSKIN  ",117173,"*","WF- 4-F      ",null,"840309117173","1","EACH",49.95,27.48,24.98,22.48,null,null,null,null,null,null,null,null,null,null,null,null,null,null,null,null,null,{"$f":"IF(OR(ISBLANK($L15),$AW$3=0),\" - \",OFFSET(O15,0,$AW$3,1,1))","v":27.48},null,null,null,null,"","",null,0,0,0,0,0,""]
[2,62,3,3,"Wlw/Org/Willow WF- 4-F","SCIENTIFIC ANGLERS FLY LINES","  FREQUENCY - TROUT WITH LOOP - BUCKSKIN  ",117180,"*","WF- 5-F      ",null,"840309117180","1","EACH",49.95,27.48,24.98,22.48,null,null,null,null,null,null,null,null,null,null,null,null,null,null,null,null,null,{"$f":"IF(OR(ISBLANK($L16),$AW$3=0),\" - \",OFFSET(O16,0,$AW$3,1,1))","v":27.48},null,null,null,null,"","",null,0,0,0,0,0,""]
[2,62,4,3,"Wlw/Org/Willow WF- 5-F","SCIENTIFIC ANGLERS FLY LINES","  FREQUENCY - TROUT WITH LOOP - BUCKSKIN  ",117197,"*","WF- 6-F      ",null,"840309117197","1","EACH",49.95,27.48,24.98,22.48,null,null,null,null,null,null,null,null,null,null,null,null,null,null,null,null,null,{"$f":"IF(OR(ISBLANK($L17),$AW$3=0),\" - \",OFFSET(O17,0,$AW$3,1,1))","v":27.48},null,null,null,null,"","",null,0,0,0,0,0,""]
[2,62,5,3,null,"SCIENTIFIC ANGLERS FLY LINES","  FREQUENCY - TROUT WITH LOOP - BUCKSKIN  ",120388,"*","WF- 7-F   *NEW*      ",null,840309120388,"1","EACH",49.95,27.48,24.98,22.48,null,null,null,null,null,null,null,null,null,null,null,null,null,null,null,null,null,27.48,null,null,null,null,{"$f":"IF($AV18=0,\"\",SUM(AK18:AN18))","v":""},{"$f":"IF($AV18>0,SUM(AR18:AU18),\"\")","v":""},null,{"$f":"IF(LEN($AJ18)>0,$AJ18*AK18,\"\")","v":0},{"$f":"IF(LEN($AJ18)>0,$AJ18*AL18,\"\")","v":0},{"$f":"IF(LEN($AJ18)>0,$AJ18*AM18,\"\")","v":0},{"$f":"IF(LEN($AJ18)>0,$AJ18*AN18,\"\")","v":0},{"$f":"COUNT(AK18:AN18)","v":0}]
[2,62,6,3,null,"SCIENTIFIC ANGLERS FLY LINES","  FREQUENCY - TROUT WITH LOOP - BUCKSKIN  ",121866,"*","WF- 8-F   *NEW*     ",null,840309121866,"1","EACH",49.95,27.48,24.98,22.48,null,null,null,null,null,null,null,null,null,null,null,null,null,null,null,null,null,27.48,null,null,null,null,"","",null,0,0,0,0,0]
[2,62,7,3,null,"SCIENTIFIC ANGLERS FLY LINES","  FREQUENCY - TROUT WITH LOOP - BUCKSKIN  ",121873,"*","WF- 9-F   *NEW*   ",null,840309121873,"1","EACH",49.95,27.48,24.98,22.48,null,null,null,null,null,null,null,null,null,null,null,null,null,null,null,null,null,27.48,null,null,null,null,"","",null,0,0,0,0,0]
[2,63,null,2,"Wlw/Org/Willow WF- 6-F","SCIENTIFIC ANGLERS FLY LINES","  FREQUENCY - BOOST WITH LOOP - WILLOW ","FREQUENCY - BOOST WITH LOOP - WILLOW",null,null,null,null,null,null,null,null,null,null,null,null,null,null,null,null,null,null,null,null,null,null,null,null,null,null,null,null,null,null,null,null,"","",null,"","","","",0,""]
[2,63,1,3,"\u0001","SCIENTIFIC ANGLERS FLY LINES","  FREQUENCY - BOOST WITH LOOP - WILLOW ",117128,null,"WF- 3-F      ",null,"840309117128","1","EACH",49.95,27.48,24.98,22.48,null,null,null,null,null,null,null,null,null,null,null,null,null,null,null,null,null,{"$f":"IF(OR(ISBLANK($L22),$AW$3=0),\" - \",OFFSET(O22,0,$AW$3,1,1))","v":27.48},null,null,null,null,"","",null,0,0,0,0,0,""]
[2,63,2,3,"Pale/Optic Grn WF-5-F/I","SCIENTIFIC ANGLERS FLY LINES","  FREQUENCY - BOOST WITH LOOP - WILLOW ",117135,null,"WF- 4-F      ",null,"840309117135","1","EACH",49.95,27.48,24.98,22.48,null,null,null,null,null,null,null,null,null,null,null,null,null,null,null,null,null,27.48,null,null,null,null,"","",null,0,0,0,0,0,""]
[2,63,3,3,"Pale/Optic Grn WF-6-F/I","SCIENTIFIC ANGLERS FLY LINES","  FREQUENCY - BOOST WITH LOOP - WILLOW ",117142,null,"WF- 5-F      ",null,"840309117142","1","EACH",49.95,27.48,24.98,22.48,null,null,null,null,null,null,null,null,null,null,null,null,null,null,null,null,null,27.48,null,null,null,null,"","",null,0,0,0,0,0,""]
[2,63,4,3,"Pale/Optic Grn WF-7-F/I","SCIENTIFIC ANGLERS FLY LINES","  FREQUENCY - BOOST WITH LOOP - WILLOW ",117159,null,"WF- 6-F      ",null,"840309117159","1","EACH",49.95,27.48,24.98,22.48,null,null,null,null,null,null,null,null,null,null,null,null,null,null,null,null,null,27.48,null,null,null,null,"","",null,{"$f":"IF(LEN($AJ25)>0,$AJ25*AK25,\"\")","v":0},{"$f":"IF(LEN($AJ25)>0,$AJ25*AL25,\"\")","v":0},{"$f":"IF(LEN($AJ25)>0,$AJ25*AM25,\"\")","v":0},{"$f":"IF(LEN($AJ25)>0,$AJ25*AN25,\"\")","v":0},0,""]
[2,63,5,3,null,"SCIENTIFIC ANGLERS FLY LINES","  FREQUENCY - BOOST WITH LOOP - WILLOW ",119979,null,"WF- 7-F   *NEW*      ",null,840309119979,"1","EACH",49.95,27.48,24.98,22.48,null,null,null,null,null,null,null,null,null,null,null,null,null,null,null,null,null,27.48,null,null,null,null,{"$f":"IF($AV26=0,\"\",SUM(AK26:AN26))","v":""},{"$f":"IF($AV26>0,SUM(AR26:AU26),\"\")","v":""},null,{"$f":"IF(LEN($AJ26)>0,$AJ26*AK26,\"\")","v":0},{"$f":"IF(LEN($AJ26)>0,$AJ26*AL26,\"\")","v":0},{"$f":"IF(LEN($AJ26)>0,$AJ26*AM26,\"\")","v":0},{"$f":"IF(LEN($AJ26)>0,$AJ26*AN26,\"\")","v":0},0,""]
[2,63,6,3,null,"SCIENTIFIC ANGLERS FLY LINES","  FREQUENCY - BOOST WITH LOOP - WILLOW ",119986,null,"WF- 8-F   *NEW*     ",null,840309119986,"1","EACH",49.95,27.48,24.98,22.48,null,null,null,null,null,null,null,null,null,null,null,null,null,null,null,null,null,27.48,null,null,null,null,"","",null,0,0,0,0,0,""]
[2,63,7,3,null,"SCIENTIFIC ANGLERS FLY LINES","  FREQUENCY - BOOST WITH LOOP - WILLOW ",119993,null,"WF- 9-F   *NEW* ",null,840309119993,"1","EACH",49.95,27.48,24.98,22.48,null,null,null,null,null,null,null,null,null,null,null,null,null,null,null,null,null,27.48,null,null,null,null,"","",null,{"$f":"IF(LEN($AJ28)>0,$AJ28*AK28,\"\")","v":0},{"$f":"IF(LEN($AJ28)>0,$AJ28*AL28,\"\")","v":0},{"$f":"IF(LEN($AJ28)>0,$AJ28*AM28,\"\")","v":0},{"$f":"IF(LEN($AJ28)>0,$AJ28*AN28,\"\")","v":0},0,""]
[2,64,null,2,"Pale/Optic Grn WF-8-F/I","SCIENTIFIC ANGLERS FLY LINES","  FREQUENCY - MAGNUM WITH LOOP - OPTIC GREEN  ","FREQUENCY - MAGNUM WITH LOOP - MIST GREEN",null,null,null,null,null,null,null,null,null,null,null,null,null,null,null,null,null,null,null,null,null,null,null,null,null,null,null,null,null,null,null,null,"",""]
[2,64,1,3,"\u0001","SCIENTIFIC ANGLERS FLY LINES","  FREQUENCY - MAGNUM WITH LOOP - OPTIC GREEN  ",117203,null,"WF- 5-F   ",null,"840309117203","1","EACH",49.95,27.48,24.98,22.48,null,null,null,null,null,null,null,null,null,null,null,null,null,null,null,null,null,{"$f":"IF(OR(ISBLANK($L30),$AW$3=0),\" - \",OFFSET(O30,0,$AW$3,1,1))","v":27.48},null,null,null,null,"","",null,0,0,0,0,{"$f":"COUNT(AK30:AN30)","v":0},{"$f":"IF($AV30<>0,ROW($AV$11),\"\")","v":""}]
[2,64,2,3,"\u0001","SCIENTIFIC ANGLERS FLY LINES","  FREQUENCY - MAGNUM WITH LOOP - OPTIC GREEN  ",117210,null,"WF- 6-F   ",null,"840309117210","1","EACH",49.95,27.48,24.98,22.48,null,null,null,null,null,null,null,null,null,null,null,null,null,null,null,null,null,{"$f":"IF(OR(ISBLANK($L31),$AW$3=0),\" - \",OFFSET(O31,0,$AW$3,1,1))","v":27.48},null,null,null,null,"","",null,0,0,0,0,0,""]
[2,64,3,3,"Orange 280 Grain","SCIENTIFIC ANGLERS FLY LINES","  FREQUENCY - MAGNUM WITH LOOP - OPTIC GREEN  ",117227,null,"WF- 7-F       ",null,"840309117227","1","EACH",49.95,27.48,24.98,22.48,null,null,null,null,null,null,null,null,null,null,null,null,null,null,null,null,null,{"$f":"IF(OR(ISBLANK($L32),$AW$3=0),\" - \",OFFSET(O32,0,$AW$3,1,1))","v":27.48},null,null,null,null,"","",null,0,0,0,0,0,""]
[2,64,4,3,"Orange 320 Grain","SCIENTIFIC ANGLERS FLY LINES","  FREQUENCY - MAGNUM WITH LOOP - OPTIC GREEN  ",117234,null,"WF- 8-F     ",null,"840309117234","1","EACH",49.95,27.48,24.98,22.48,null,null,null,null,null,null,null,null,null,null,null,null,null,null,null,null,null,{"$f":"IF(OR(ISBLANK($L33),$AW$3=0),\" - \",OFFSET(O33,0,$AW$3,1,1))","v":27.48},null,null,null,null,{"$f":"IF($AV33=0,\"\",SUM(AK33:AN33))","v":""},{"$f":"IF($AV33>0,SUM(AR33:AU33),\"\")","v":""},null,{"$f":"IF(LEN($AJ33)>0,$AJ33*AK33,\"\")","v":0},{"$f":"IF(LEN($AJ33)>0,$AJ33*AL33,\"\")","v":0},{"$f":"IF(LEN($AJ33)>0,$AJ33*AM33,\"\")","v":0},{"$f":"IF(LEN($AJ33)>0,$AJ33*AN33,\"\")","v":0},{"$f":"COUNT(AK33:AN33)","v":0},""]
[2,64,5,3,"Orange 320 Grain","SCIENTIFIC ANGLERS FLY LINES","  FREQUENCY - MAGNUM WITH LOOP - OPTIC GREEN  ",123860,null,"WF- 9-F   *NEW*",null,840309123860,"1","EACH",49.95,27.48,24.98,22.48,null,null,null,null,null,null,null,null,null,null,null,null,null,null,null,null,null,{"$f":"IF(OR(ISBLANK($L34),$AW$3=0),\" - \",OFFSET(O34,0,$AW$3,1,1))","v":27.48},null,null,null,null,"","",null,0,0,0,0,0,""]
[2,65,null,2,"Orange 360 Grain","SCIENTIFIC ANGLERS FLY LINES","FREQUENCY - SINK TIP TYPE III - OPTIC YELLOW/DK GREEN","FREQUENCY - SINK TIP TYPE III - YELLOW / GREEN",null,null,null,null,null,null,null,null,null,null,null,null,null,null,null,null,null,null,null,null,null,null,null,null,null,null,null,null,null,null,null,null,"",""]
[2,65,1,3,"Orange 400 Grain","SCIENTIFIC ANGLERS FLY LINES","FREQUENCY - SINK TIP TYPE III - OPTIC YELLOW/DK GREEN",117241,null,"WF- 5-F/S      ",null,"840309117241","1","EACH",49.95,27.48,24.98,22.48,null,null,null,null,null,null,null,null,null,null,null,null,null,null,null,null,null,{"$f":"IF(OR(ISBLANK($L36),$AW$3=0),\" - \",OFFSET(O36,0,$AW$3,1,1))","v":27.48},null,null,null,null,"","",null,0,0,0,0,0,""]
[2,65,2,3,"Orange 440 Grain","SCIENTIFIC ANGLERS FLY LINES","FREQUENCY - SINK TIP TYPE III - OPTIC YELLOW/DK GREEN",117258,null,"WF- 6-F/S      ",null,"840309117258","1","EACH",49.95,27.48,24.98,22.48,null,null,null,null,null,null,null,null,null,null,null,null,null,null,null,null,null,{"$f":"IF(OR(ISBLANK($L37),$AW$3=0),\" - \",OFFSET(O37,0,$AW$3,1,1))","v":27.48},null,null,null,null,"","",null,{"$f":"IF(LEN($AJ37)>0,$AJ37*AK37,\"\")","v":0},0,0,0,0,""]
[2,65,3,3,"Orange 480 Grain","SCIENTIFIC ANGLERS FLY LINES","FREQUENCY - SINK TIP TYPE III - OPTIC YELLOW/DK GREEN",117265,null,"WF- 7-F/S      ",null,"840309117265","1","EACH",49.95,27.48,24.98,22.48,null,null,null,null,null,null,null,null,null,null,null,null,null,null,null,null,null,{"$f":"IF(OR(ISBLANK($L38),$AW$3=0),\" - \",OFFSET(O38,0,$AW$3,1,1))","v":27.48},null,null,null,null,"","",null,0,0,0,0,0,""]
[2,65,4,3,"Orange 520 Grain","SCIENTIFIC ANGLERS FLY LINES","FREQUENCY - SINK TIP TYPE III - OPTIC YELLOW/DK GREEN",117272,null,"WF- 8-F/S      ",null,"840309117272","1","EACH",49.95,27.48,24.98,22.48,null,null,null,null,null,null,null,null,null,null,null,null,null,null,null,null,null,{"$f":"IF(OR(ISBLANK($L39),$AW$3=0),\" - \",OFFSET(O39,0,$AW$3,1,1))","v":27.48},null,null,null,null,{"$f":"IF($AV39=0,\"\",SUM(AK39:AN39))","v":""},{"$f":"IF($AV39>0,SUM(AR39:AU39),\"\")","v":""},null,{"$f":"IF(LEN($AJ39)>0,$AJ39*AK39,\"\")","v":0},{"$f":"IF(LEN($AJ39)>0,$AJ39*AL39,\"\")","v":0},{"$f":"IF(LEN($AJ39)>0,$AJ39*AM39,\"\")","v":0},{"$f":"IF(LEN($AJ39)>0,$AJ39*AN39,\"\")","v":0},{"$f":"COUNT(AK39:AN39)","v":0},""]
[2,65,5,3,"Orange 520 Grain","SCIENTIFIC ANGLERS FLY LINES","FREQUENCY - SINK TIP TYPE III - OPTIC YELLOW/DK GREEN",123617,null,"WF-9-F/S   *NEW*",null,840309123617,"1","EACH",49.95,27.48,24.98,22.48,null,null,null,null,null,null,null,null,null,null,null,null,null,null,null,null,null,{"$f":"IF(OR(ISBLANK($L40),$AW$3=0),\" - \",OFFSET(O40,0,$AW$3,1,1))","v":27.48},null,null,null,null,"","",null,0,0,0,0,0,""]
{"$rows_left_out":372}
{"sheet":"Search","index":1,"n_rows":7,"n_cols":3,"rows_kept":7,"cut":false,"hidden":false,"merged":[]}
[]
[]
[]
[null,"Product Number",123]
[null,null,{"$f":"\"- OR -\"","v":"- OR -"}]
[null,"Description Keywords"]
[null,null,"Separate multiple keywords with a space between each word."]

{"sheet":"PriceLevels","index":2,"n_rows":4,"n_cols":3,"rows_kept":4,"cut":false,"hidden":true,"merged":[]}
["PriceCol","PriceLevel","RealPriceCol"]
[1,"Level 1",1]
[2,"Level 2",2]
[3,"Level 3",3]